Target
ALK tyrosine kinase receptor
Ligand
BDBM50524989
Substrate
Meas. Tech.
ChEMBL_1895112 (CHEMBL4397147)
IC50
13±n/a nM
Citation
 Fushimi, MFujimori, IWakabayashi, THasui, TKawakita, YImamura, KKato, TMurakami, MIshii, TKikko, YKasahara, MNakatani, AHiura, YMiyamoto, MSaikatendu, KZou, HLane, SWLawson, JDImoto, H Discovery of Potent, Selective, and Brain-Penetrant 1 H-Pyrazol-5-yl-1 H-pyrrolo[2,3- b]pyridines as Anaplastic Lymphoma Kinase (ALK) Inhibitors. J Med Chem 62:4915-4935 (2019)  
Target
Name:
ALK tyrosine kinase receptor
Synonyms:
ALK ALK_HUMAN CD_antigen: CD246
Type:
Protein
Mol. Mass.:
176453.10
Organism:
Homo sapiens (Human)
Description:
Q9UM73
Residue:
1620
  
Inhibitor
Name:
BDBM50524989
Synonyms:
CHEMBL4535072
Type:
Small organic molecule
Emp. Form.:
C19H19FN6O2S
Mol. Mass.:
414.457
SMILES:
C[C@H](Nc1ccc2c(cn(-c3cc(C)[nH]n3)c2n1)S(C)(=O)=O)c1ccc(F)cn1
: