Target
High affinity nerve growth factor receptor
Ligand
BDBM50524980
Substrate
Meas. Tech.
ChEMBL_1895111 (CHEMBL4397146)
IC50
1200±n/a nM
Citation
 Fushimi, MFujimori, IWakabayashi, THasui, TKawakita, YImamura, KKato, TMurakami, MIshii, TKikko, YKasahara, MNakatani, AHiura, YMiyamoto, MSaikatendu, KZou, HLane, SWLawson, JDImoto, H Discovery of Potent, Selective, and Brain-Penetrant 1 H-Pyrazol-5-yl-1 H-pyrrolo[2,3- b]pyridines as Anaplastic Lymphoma Kinase (ALK) Inhibitors. J Med Chem 62:4915-4935 (2019)  
Target
Name:
High affinity nerve growth factor receptor
Synonyms:
2.7.10.1 NTRK1 NTRK1_HUMAN Neurotrophic tyrosine kinase receptor type 1 Synonyms=MTC TRK1-transforming tyrosine kinase protein TRKA GN Tropomyosin alpha-3 chain/High affinity nerve growth factor receptor Tropomyosin-related kinase A (TrkA) Tyrosine kinase receptor (Trk) Tyrosine kinase receptor A (Trk A) Tyrosine kinase receptor A (TrkA) p140-TrkA
Type:
Mol. Mass.:
87498.18
Organism:
Homo sapiens (Human)
Description:
P04629
Residue:
796
  
Inhibitor
Name:
BDBM50524980
Synonyms:
CHEMBL4437605
Type:
Small organic molecule
Emp. Form.:
C23H24FN7O2
Mol. Mass.:
449.4808
SMILES:
C[C@H](Nc1ccc2c(cn(-c3cc(C)n[nH]3)c2n1)C(=O)N1CCOCC1)c1ccc(F)cn1
: