Target
Aromatase
Ligand
BDBM50121079
Substrate
Meas. Tech.
ChEMBL_1897005 (CHEMBL4399040)
IC50
0.250000±n/a nM
Citation
 Zaraei, SOAbduelkarem, ARAnbar, HSKobeissi, SMohammad, MOssama, AEl-Gamal, MI Sulfamates in drug design and discovery: Pre-clinical and clinical investigations. Eur J Med Chem 179:257-271 (2019)  
Target
Name:
Aromatase
Synonyms:
ARO1 CP19A_HUMAN CYP19 CYPXIX Cytochrome P450 19A1 Cytochrome P450-C19 (CYP19) FL cytokine receptor precursor | P-450AROM
Type:
Enzyme
Mol. Mass.:
57888.92
Organism:
Homo sapiens (Human)
Description:
P11511
Residue:
503
  
Inhibitor
Name:
BDBM50121079
Synonyms:
CHEMBL3622064
Type:
Small organic molecule
Emp. Form.:
C20H15BrN6O3S
Mol. Mass.:
499.34
SMILES:
NS(=O)(=O)Oc1ccc2cc(CN(c3ccc(cc3)C#N)n3cnnc3)ccc2c1Br
: