Target
Proto-oncogene tyrosine-protein kinase Src
Ligand
BDBM50080187
Substrate
Meas. Tech.
ChEMBL_202596 (CHEMBL806420)
IC50
16000±n/a nM
Citation
 Buchanan, JLVu, CBMerry, TJCorpuz, EGPradeepan, SGMani, UNYang, MPlake, HRVarkhedkar, VMLynch, BAMacNeil, IALoiacono, KATiong, CLHolt, DA Structure-activity relationships of a novel class of Src SH2 inhibitors. Bioorg Med Chem Lett 9:2359-64 (1999)  
Target
Name:
Proto-oncogene tyrosine-protein kinase Src
Synonyms:
Calmodulin/Proto-oncogene tyrosine-protein kinase Src Proto-oncogene c-Src SRC SRC_HUMAN V-src sarcoma (Schmidt-Ruppin A-2) viral oncogene homolog (avian) p60-Src | pp60c-src
Type:
Protein
Mol. Mass.:
59838.60
Organism:
Homo sapiens (Human)
Description:
P12931
Residue:
536
  
Inhibitor
Name:
BDBM50080187
Synonyms:
(S)-4-[(S)-2-Acetylamino-3-(4-phosphonooxy-phenyl)-propionylamino]-4-(5-cyclohexylmethyl-thiazol-2-yl)-butyric acid | CHEMBL77673
Type:
Small organic molecule
Emp. Form.:
C25H34N3O8PS
Mol. Mass.:
567.592
SMILES:
CC(=O)N[C@@H](Cc1ccc(OP(O)(O)=O)cc1)C(=O)N[C@@H](CCC(O)=O)c1ncc(CC2CCCCC2)s1
: