Target
Proto-oncogene tyrosine-protein kinase Src
Ligand
BDBM50080194
Substrate
Meas. Tech.
ChEMBL_202596 (CHEMBL806420)
IC50
320000±n/a nM
Citation
 Buchanan, JLVu, CBMerry, TJCorpuz, EGPradeepan, SGMani, UNYang, MPlake, HRVarkhedkar, VMLynch, BAMacNeil, IALoiacono, KATiong, CLHolt, DA Structure-activity relationships of a novel class of Src SH2 inhibitors. Bioorg Med Chem Lett 9:2359-64 (1999)  
Target
Name:
Proto-oncogene tyrosine-protein kinase Src
Synonyms:
Calmodulin/Proto-oncogene tyrosine-protein kinase Src Proto-oncogene c-Src SRC SRC_HUMAN V-src sarcoma (Schmidt-Ruppin A-2) viral oncogene homolog (avian) p60-Src | pp60c-src
Type:
Protein
Mol. Mass.:
59838.60
Organism:
Homo sapiens (Human)
Description:
P12931
Residue:
536
  
Inhibitor
Name:
BDBM50080194
Synonyms:
CHEMBL76201 | Phosphoric acid mono-[4-((S)-2-acetylamino-2-{(S)-3-carbamoyl-1-[3-(3-methyl-butyl)-[1,2,4]oxadiazol-5-yl]-propylcarbamoyl}-ethyl)-phenyl] ester
Type:
Small organic molecule
Emp. Form.:
C22H32N5O8P
Mol. Mass.:
525.4919
SMILES:
CC(C)CCc1noc(n1)[C@H](CCC(N)=O)NC(=O)[C@H](Cc1ccc(OP(O)(O)=O)cc1)NC(C)=O
: