Target
Proto-oncogene tyrosine-protein kinase Src
Ligand
BDBM50080203
Substrate
Meas. Tech.
ChEMBL_202596 (CHEMBL806420)
IC50
89000±n/a nM
Citation
 Buchanan, JLVu, CBMerry, TJCorpuz, EGPradeepan, SGMani, UNYang, MPlake, HRVarkhedkar, VMLynch, BAMacNeil, IALoiacono, KATiong, CLHolt, DA Structure-activity relationships of a novel class of Src SH2 inhibitors. Bioorg Med Chem Lett 9:2359-64 (1999)  
Target
Name:
Proto-oncogene tyrosine-protein kinase Src
Synonyms:
Calmodulin/Proto-oncogene tyrosine-protein kinase Src Proto-oncogene c-Src SRC SRC_HUMAN V-src sarcoma (Schmidt-Ruppin A-2) viral oncogene homolog (avian) p60-Src | pp60c-src
Type:
Protein
Mol. Mass.:
59838.60
Organism:
Homo sapiens (Human)
Description:
P12931
Residue:
536
  
Inhibitor
Name:
BDBM50080203
Synonyms:
CHEMBL405008 | Phosphoric acid mono-[4-((S)-2-acetylamino-2-{(S)-2-(1H-indol-3-yl)-1-[3-(4-methyl-pentyl)-[1,2,4]oxadiazol-5-yl]-ethylcarbamoyl}-ethyl)-phenyl] ester
Type:
Small organic molecule
Emp. Form.:
C29H36N5O7P
Mol. Mass.:
597.5992
SMILES:
CC(C)CCCc1noc(n1)[C@H](Cc1c[nH]c2ccccc12)NC(=O)[C@H](Cc1ccc(OP(O)(O)=O)cc1)NC(C)=O
: