Target
Calpain-1 catalytic subunit
Ligand
BDBM50080212
Substrate
Meas. Tech.
ChEMBL_43670 (CHEMBL656203)
Ki
1100±n/a nM
Citation
 Chatterjee, SDunn, DTao, MWells, GGu, ZQBihovsky, RAtor, MASiman, RMallamo, JP P2-achiral, P'-extended alpha-ketoamide inhibitors of calpain I. Bioorg Med Chem Lett 9:2371-4 (1999)  
Target
Name:
Calpain-1 catalytic subunit
Synonyms:
CAN1_HUMAN CAPN1 Calpain-1 (u-Calpain) Calpain1
Type:
Protein
Mol. Mass.:
81880.51
Organism:
Homo sapiens (Human)
Description:
Residue:
714
  
Inhibitor
Name:
BDBM50080212
Synonyms:
(S)-2-Oxo-4-phenyl-3-(4-phenyl-butyrylamino)-N-[2-(5-pyridin-2-yl-thiophene-2-sulfonylamino)-ethyl]-butyramide | CHEMBL307309
Type:
Small organic molecule
Emp. Form.:
C31H32N4O5S2
Mol. Mass.:
604.74
SMILES:
O=C(CCCc1ccccc1)N[C@@H](Cc1ccccc1)C(=O)C(=O)NCCNS(=O)(=O)c1ccc(s1)-c1ccccn1
: