Target
Calpain-1 catalytic subunit
Ligand
BDBM50080221
Substrate
Meas. Tech.
ChEMBL_43861 (CHEMBL658521)
Ki
49±n/a nM
Citation
 Chatterjee, SDunn, DTao, MWells, GGu, ZQBihovsky, RAtor, MASiman, RMallamo, JP P2-achiral, P'-extended alpha-ketoamide inhibitors of calpain I. Bioorg Med Chem Lett 9:2371-4 (1999)  
Target
Name:
Calpain-1 catalytic subunit
Synonyms:
CAN1_HUMAN CAPN1 Calpain-1 (u-Calpain) Calpain1
Type:
Protein
Mol. Mass.:
81880.51
Organism:
Homo sapiens (Human)
Description:
Residue:
714
  
Inhibitor
Name:
BDBM50080221
Synonyms:
CHEMBL306616 | N-{(S)-1-Benzyl-2-oxo-2-[2-(5-pyridin-2-yl-thiophene-2-sulfonylamino)-ethylcarbamoyl]-ethyl}-2,5-dichloro-benzamide
Type:
Small organic molecule
Emp. Form.:
C28H24Cl2N4O5S2
Mol. Mass.:
631.55
SMILES:
Clc1ccc(Cl)c(c1)C(=O)N[C@@H](Cc1ccccc1)C(=O)C(=O)NCCNS(=O)(=O)c1ccc(s1)-c1ccccn1
: