Target
Calpain-1 catalytic subunit
Ligand
BDBM50080227
Substrate
Meas. Tech.
ChEMBL_43861 (CHEMBL658521)
Ki
8±n/a nM
Citation
 Chatterjee, SDunn, DTao, MWells, GGu, ZQBihovsky, RAtor, MASiman, RMallamo, JP P2-achiral, P'-extended alpha-ketoamide inhibitors of calpain I. Bioorg Med Chem Lett 9:2371-4 (1999)  
Target
Name:
Calpain-1 catalytic subunit
Synonyms:
CAN1_HUMAN CAPN1 Calpain-1 (u-Calpain) Calpain1
Type:
Protein
Mol. Mass.:
81880.51
Organism:
Homo sapiens (Human)
Description:
Residue:
714
  
Inhibitor
Name:
BDBM50080227
Synonyms:
CHEMBL305715 | N-((S)-1-Benzyl-2-{2-[5-(3-cyano-phenyl)-thiophene-2-sulfonylamino]-ethylcarbamoyl}-2-oxo-ethyl)-2,6-dichloro-benzamide
Type:
Small organic molecule
Emp. Form.:
C30H24Cl2N4O5S2
Mol. Mass.:
655.571
SMILES:
Clc1cccc(Cl)c1C(=O)N[C@@H](Cc1ccccc1)C(=O)C(=O)NCCNS(=O)(=O)c1ccc(s1)-c1cccc(c1)C#N
: