Target
Rap guanine nucleotide exchange factor 3
Ligand
BDBM81289
Substrate
Meas. Tech.
ChEMBL_1900218 (CHEMBL4402333)
EC50
5620±n/a nM
Citation
 Lelle, MOtte, MThon, SBertinetti, DHerberg, FWBenndorf, K Chemical synthesis and biological activity of novel brominated 7-deazaadenosine-3',5'-cyclic monophosphate derivatives. Bioorg Med Chem 27:1704-1713 (2019)  
Target
Name:
Rap guanine nucleotide exchange factor 3
Synonyms:
CGEF1 EPAC 1 Exchange factor directly activated by cAMP 1 RAPGEF3 Rap1 guanine-nucleotide-exchange factor directly activated by cAMP cAMP-regulated guanine nucleotide exchange factor I
Type:
PROTEIN
Mol. Mass.:
103769.52
Organism:
Homo sapiens (Human)
Description:
ChEMBL_104531
Residue:
923
  
Inhibitor
Name:
BDBM81289
Synonyms:
Adenosine 3',5'-cyclic monophosphate sodium salt monohydrate SMR000875274 sodium;(4aR,6R,7R,7aS)-6-(6-aminopurin-9-yl)-2-oxidanidyl-2-oxidanylidene-4a,6,7,7a-tetrahydro-4H-furo[3,2-d][1,3,2]dioxaphosphinin-7-ol sodium;(4aR,6R,7R,7aS)-6-(6-aminopurin-9-yl)-2-oxido-2-oxo-4a,6,7,7a-tetrahydro-4H-furo[3,2-d][1,3,2]dioxaphosphorin-7-ol | sodium;(4aR,6R,7R,7aS)-6-adenin-9-yl-2-keto-2-oxido-4a,6,7,7a-tetrahydro-4H-furo[3,2-d][1,3,2]dioxaphosphorin-7-ol
Type:
Small organic molecule
Emp. Form.:
C10H11N5O6P
Mol. Mass.:
328.1986
SMILES:
Nc1ncnc2n(cnc12)[C@@H]1O[C@@H]2COP([O-])(=O)O[C@H]2[C@H]1O
: