Target
Voltage-dependent N-type calcium channel subunit alpha-1B
Ligand
BDBM50081682
Substrate
Meas. Tech.
ChEMBL_141329 (CHEMBL752908)
IC50
830.0±n/a nM
Citation
 Hu, LYRyder, TRRafferty, MFFeng, MRLotarski, SMRock, DMSinz, MStoehr, SJTaylor, CPWeber, MLBowersox, SSMiljanich, GPMillerman, EWang, YXSzoke, BG Synthesis of a series of 4-benzyloxyaniline analogues as neuronal N-type calcium channel blockers with improved anticonvulsant and analgesic properties. J Med Chem 42:4239-49 (1999)  
Target
Name:
Voltage-dependent N-type calcium channel subunit alpha-1B
Synonyms:
BIII CAC1B_HUMAN CACNA1B Calcium channel (Type N) Voltage-dependent N-type calcium channel subunit alpha-1B Voltage-gated N-type calcium channel alpha-1B subunit Voltage-gated calcium channel Voltage-gated calcium channel subunit alpha Cav2.2 ((alpha 1B, beta 1b, alpha 2 delta-1) | calcium channel, voltage-dependent, N type, alpha 1B subunit
Type:
Enzyme
Mol. Mass.:
262548.16
Organism:
Homo sapiens (Human)
Description:
Q00975
Residue:
2339
  
Inhibitor
Name:
BDBM50081682
Synonyms:
Azepane-1-carboxylic acid ((S)-1-{4-[(4-benzyloxy-phenyl)-ethyl-amino]-piperidine-1-carbonyl}-3-methyl-butyl)-amide | CHEMBL135637
Type:
Small organic molecule
Emp. Form.:
C33H48N4O3
Mol. Mass.:
548.7592
SMILES:
CCN(C1CCN(CC1)C(=O)[C@H](CC(C)C)NC(=O)N1CCCCCC1)c1ccc(OCc2ccccc2)cc1
: