Target
Voltage-dependent N-type calcium channel subunit alpha-1B
Ligand
BDBM50081683
Substrate
Meas. Tech.
ChEMBL_141329 (CHEMBL752908)
IC50
2500±n/a nM
Citation
 Hu, LYRyder, TRRafferty, MFFeng, MRLotarski, SMRock, DMSinz, MStoehr, SJTaylor, CPWeber, MLBowersox, SSMiljanich, GPMillerman, EWang, YXSzoke, BG Synthesis of a series of 4-benzyloxyaniline analogues as neuronal N-type calcium channel blockers with improved anticonvulsant and analgesic properties. J Med Chem 42:4239-49 (1999)  
Target
Name:
Voltage-dependent N-type calcium channel subunit alpha-1B
Synonyms:
BIII CAC1B_HUMAN CACNA1B Calcium channel (Type N) Voltage-dependent N-type calcium channel subunit alpha-1B Voltage-gated N-type calcium channel alpha-1B subunit Voltage-gated calcium channel Voltage-gated calcium channel subunit alpha Cav2.2 ((alpha 1B, beta 1b, alpha 2 delta-1) | calcium channel, voltage-dependent, N type, alpha 1B subunit
Type:
Enzyme
Mol. Mass.:
262548.16
Organism:
Homo sapiens (Human)
Description:
Q00975
Residue:
2339
  
Inhibitor
Name:
BDBM50081683
Synonyms:
Azepane-1-carboxylic acid {(S)-1-[4-(4-benzyloxy-phenylamino)-piperidine-1-carbonyl]-3-methyl-butyl}-amide | CHEMBL422096
Type:
Small organic molecule
Emp. Form.:
C31H44N4O3
Mol. Mass.:
520.7061
SMILES:
CC(C)C[C@H](NC(=O)N1CCCCCC1)C(=O)N1CCC(CC1)Nc1ccc(OCc2ccccc2)cc1
: