Target
Heme oxygenase 2
Ligand
BDBM50375318
Substrate
Meas. Tech.
ChEMBL_1901235 (CHEMBL4403457)
IC50
5000±n/a nM
Citation
 Intagliata, SSalerno, LCiaffaglione, VLeonardi, CFallica, ANCarota, GAmata, EMarrazzo, APittalą, VRomeo, G Heme Oxygenase-2 (HO-2) as a therapeutic target: Activators and inhibitors. Eur J Med Chem 183:0 (2019)  
Target
Name:
Heme oxygenase 2
Synonyms:
HMOX2_RAT Heme oxygenase 2 | Hmox2
Type:
Enzyme
Mol. Mass.:
35754.99
Organism:
Rattus norvegicus (rat)
Description:
HO-2 obtained from rat brain was used in enzyme assays.
Residue:
315
  
Inhibitor
Name:
BDBM50375318
Synonyms:
Fungistat Panlomyc TERCONAZOLE Terazol 3 med.21724, Compound Terconazole
Type:
Small organic molecule
Emp. Form.:
C26H31Cl2N5O3
Mol. Mass.:
532.462
SMILES:
CC(C)N1CCN(CC1)c1ccc(OC[C@H]2CO[C@@](Cn3cncn3)(O2)c2ccc(Cl)cc2Cl)cc1
: