Target
5-hydroxytryptamine receptor 7
Ligand
BDBM50116766
Substrate
Meas. Tech.
ChEMBL_1904388 (CHEMBL4406610)
Ki
1188±n/a nM
Citation
 Moritz, AEFree, RBWeiner, WSAkano, EOGandhi, DAbramyan, AKeck, TMFerrer, MHu, XSouthall, NSteiner, JAubé, JShi, LFrankowski, KJSibley, DR Discovery, Optimization, and Characterization of ML417: A Novel and Highly Selective D J Med Chem 63:5526-5567 (2020)  
Target
Name:
5-hydroxytryptamine receptor 7
Synonyms:
5-HT-7 5-HT7 5-HT7S 5HT7 HTR7 | Serotonin receptor 7
Type:
G Protein-Coupled Receptor (GPCR)
Mol. Mass.:
53573.08
Organism:
Homo sapiens (Human)
Description:
P34969
Residue:
479
  
Inhibitor
Name:
BDBM50116766
Synonyms:
(-)-Pramipexole 2,6-Benzothiazolediamine, 4,5,6,7-tetrahydro-N(sup 6)-propyl-, (S)- PRAMIPEXOLE | cid_119570
Type:
Small organic molecule
Emp. Form.:
C10H17N3S
Mol. Mass.:
211.327
SMILES:
CCCN[C@H]1CCc2nc(N)sc2C1
: