Target
Carbonic anhydrase 7
Ligand
BDBM10880
Substrate
Meas. Tech.
ChEMBL_1904506 (CHEMBL4406728)
Ki
2.5±n/a nM
Citation
 Nocentini, AAlterio, VBua, SMicheli, LEsposito, DBuonanno, MBartolucci, GOsman, SMALOthman, ZACirilli, RPierini, MMonti, SMDi Cesare Mannelli, LGratteri, PGhelardini, CDe Simone, GSupuran, CT Phenyl(thio)phosphon(amid)ate Benzenesulfonamides as Potent and Selective Inhibitors of Human Carbonic Anhydrases II and VII Counteract Allodynia in a Mouse Model of Oxaliplatin-Induced Neuropathy. J Med Chem 63:5185-5200 (2020)  
Target
Name:
Carbonic anhydrase 7
Synonyms:
CA-VII CAH7_HUMAN Carbonic anhydrase Carbonic anhydrase VII (CA VII)
Type:
Enzyme
Mol. Mass.:
29664.11
Organism:
Homo sapiens (Human)
Description:
Human cloned isozyme.
Residue:
264
  
Inhibitor
Name:
BDBM10880
Synonyms:
AZA AZM acetazolamide Acetazolamide Acetazolamide (AZA) Acetazolamide, 5 Acetazolamide, AZA CHEMBL20 Sulfonamide, 1 US11278534, Example acetazolamide sulfonamide 1
Type:
Small organic molecule
Emp. Form.:
C4H6N4O3S2
Mol. Mass.:
222.245
SMILES:
CC(=O)Nc1nnc(s1)S(N)(=O)=O
: