Target
Sodium-dependent serotonin transporter
Ligand
BDBM50083531
Substrate
Meas. Tech.
ChEBML_201818
Ki
430.0±n/a nM
Citation
 Lomenzo, SAIzenwasser, SGerdes, RMKatz, JLKopajtic, TTrudell, ML Synthesis, dopamine and serotonin transporter binding affinities of novel analogues of meperidine. Bioorg Med Chem Lett 9:3273-6 (2000)  
Target
Name:
Sodium-dependent serotonin transporter
Synonyms:
5-HT Transporter 5HT transporter Anandamid membrane transporter, AMT Monoamine transporters; Norepinephrine & serotonin Slc6a4 Sodium-dependent serotonin transporter (SERT) | imipramine receptor
Type:
Multi-pass membrane protein
Mol. Mass.:
70168.43
Organism:
Rattus norvegicus (rat)
Description:
P31652
Residue:
630
  
Inhibitor
Name:
BDBM50083531
Synonyms:
4-(4-Iodo-phenyl)-1-methyl-piperidine-4-carbonitrile CHEMBL536037
Type:
Small organic molecule
Emp. Form.:
C13H15IN2
Mol. Mass.:
326.1761
SMILES:
CN1CCC(CC1)(C#N)c1ccc(I)cc1
: