Target
Sodium-dependent serotonin transporter
Ligand
BDBM50083536
Substrate
Meas. Tech.
ChEBML_201818
Ki
19±n/a nM
Citation
 Lomenzo, SAIzenwasser, SGerdes, RMKatz, JLKopajtic, TTrudell, ML Synthesis, dopamine and serotonin transporter binding affinities of novel analogues of meperidine. Bioorg Med Chem Lett 9:3273-6 (2000)  
Target
Name:
Sodium-dependent serotonin transporter
Synonyms:
5-HT Transporter 5HT transporter Anandamid membrane transporter, AMT Monoamine transporters; Norepinephrine & serotonin Slc6a4 Sodium-dependent serotonin transporter (SERT) | imipramine receptor
Type:
Multi-pass membrane protein
Mol. Mass.:
70168.43
Organism:
Rattus norvegicus (rat)
Description:
P31652
Residue:
630
  
Inhibitor
Name:
BDBM50083536
Synonyms:
4-(3,4-Dichloro-phenyl)-1-methyl-piperidine-4-carboxylic acid ethyl ester CHEMBL541124
Type:
Small organic molecule
Emp. Form.:
C15H19Cl2NO2
Mol. Mass.:
316.223
SMILES:
CCOC(=O)C1(CCN(C)CC1)c1ccc(Cl)c(Cl)c1
: