Target
Cyclin-dependent kinase 6/G1/S-specific cyclin-D3
Ligand
BDBM253928
Substrate
Meas. Tech.
ChEMBL_1906452 (CHEMBL4408810)
IC50
4.0±n/a nM
Citation
 Sánchez-Martínez, CLallena, MJSanfeliciano, SGde Dios, A Cyclin dependent kinase (CDK) inhibitors as anticancer drugs: Recent advances (2015-2019). Bioorg Med Chem Lett 29:0 (2019)  
Target
Name:
Cyclin-dependent kinase 6/G1/S-specific cyclin-D3
Synonyms:
CDK6/CycD3 CDK6/G1/S-specific cyclin D3 Cyclin-dependent kinase 6 | Cyclin-dependent kinase 6/G1/S-specific cyclin D3
Type:
Protein
Mol. Mass.:
Description:
Components:
This complex has 2 components.
Component 1
Name:
Cyclin-dependent kinase 6
Synonyms:
CDK6 CDKN6 Cyclin-dependent kinase 6 (CDK 6) | Serine/threonine-protein kinase PLSTIRE
Type:
Enzyme Subunit
Mol. Mass.:
36937.42
Organism:
Homo sapiens (Human)
Description:
Q00534
Residue:
326
  
Component 2
Name:
G1/S-specific cyclin-D3
Synonyms:
CCND3 | CCND3_HUMAN
Type:
Enzyme
Mol. Mass.:
32521.90
Organism:
Homo sapiens (Human)
Description:
P30281
Residue:
292
  
Inhibitor
Name:
BDBM253928
Synonyms:
US10189849, Compound 27 US9464092, T US9957276, Compound 27
Type:
Small organic molecule
Emp. Form.:
C24H30N8O
Mol. Mass.:
446.548
SMILES:
CN1CCN(CC1)c1ccc(Nc2ncc3cc4C(=O)NCC5(CCCCC5)n4c3n2)nc1
: