Target
Cyclin-dependent kinase 2
Ligand
BDBM50347389
Substrate
Meas. Tech.
ChEMBL_1906413 (CHEMBL4408771)
IC50
900±n/a nM
Citation
 Sánchez-Martínez, CLallena, MJSanfeliciano, SGde Dios, A Cyclin dependent kinase (CDK) inhibitors as anticancer drugs: Recent advances (2015-2019). Bioorg Med Chem Lett 29:0 (2019)  
Target
Name:
Cyclin-dependent kinase 2
Synonyms:
CDK2 CDK2_HUMAN Cell division protein kinase 2 Protein cereblon/Cyclin-dependent kinase 2 | p33 protein kinase
Type:
Enzyme Subunit
Mol. Mass.:
33938.17
Organism:
Homo sapiens (Human)
Description:
P24941
Residue:
298
  
Inhibitor
Name:
BDBM50347389
Synonyms:
CHEMBL1801932
Type:
Small organic molecule
Emp. Form.:
C22H32N6
Mol. Mass.:
380.5297
SMILES:
CC(C)c1cnn2c(NCc3ccccc3)cc(NCCCCCCN)nc12
: