Target
Peroxisome proliferator-activated receptor gamma
Ligand
BDBM50088494
Substrate
Meas. Tech.
ChEMBL_154518 (CHEMBL764404)
EC50
537±n/a nM
Citation
 Henke, BRAdkison, KKBlanchard, SGLeesnitzer, LMMook, RAPlunket, KDRay, JARoberson, CUnwalla, RWillson, TM Synthesis and biological activity of a novel series of indole-derived PPARgamma agonists. Bioorg Med Chem Lett 9:3329-34 (2000)  
Target
Name:
Peroxisome proliferator-activated receptor gamma
Synonyms:
NR1C3 PPAR-gamma PPARG_HUMAN Peroxisome proliferator-activated receptor gamma (PPAR gamma) Peroxisome proliferator-activated receptor gamma (PPARĪ³) peroxisome proliferator-activated receptor gamma isoform 2
Type:
Nuclear Receptor
Mol. Mass.:
57613.46
Organism:
Homo sapiens (Human)
Description:
P37231
Residue:
505
  
Inhibitor
Name:
BDBM50088494
Synonyms:
BDBM50101974 CI-991 GR-92132X Prelay TROGLITAZONE
Type:
Small organic molecule
Emp. Form.:
C24H27NO5S
Mol. Mass.:
441.54
SMILES:
Cc1c(C)c2OC(C)(COc3ccc(CC4SC(=O)NC4=O)cc3)CCc2c(C)c1O
: