Target
Metabotropic glutamate receptor 5
Ligand
BDBM50084142
Substrate
Meas. Tech.
ChEMBL_104300 (CHEMBL709915)
EC50
750000±n/a nM
Citation
 Costantino, GMacchiarulo, APellicciari, R Modeling of amino-terminal domains of group I metabotropic glutamate receptors: structural motifs affecting ligand selectivity. J Med Chem 42:5390-401 (2000)  
Target
Name:
Metabotropic glutamate receptor 5
Synonyms:
GPRC1E GRM5_HUMAN metabotropic glutamate 5 | metabotropic glutamate 5a
Type:
Enzyme
Mol. Mass.:
132484.72
Organism:
Homo sapiens (Human)
Description:
Residue:
1212
  
Inhibitor
Name:
BDBM50084142
Synonyms:
Amino-(2-chloro-5-hydroxy-phenyl)-acetic acid CHPG
Type:
Small organic molecule
Emp. Form.:
C8H8ClNO3
Mol. Mass.:
201.607
SMILES:
NC(C(O)=O)c1cc(O)ccc1Cl
: