Target
Neutrophil elastase
Ligand
BDBM50084228
Substrate
Meas. Tech.
ChEMBL_86536 (CHEMBL699955)
Kd
5500±n/a nM
Citation
 Gütschow, MKuerschner, LNeumann, UPietsch, MLöser, RKoglin, NEger, K 2-(diethylamino)thieno1,3??xazin-4-ones as stable inhibitors of human leukocyte elastase. J Med Chem 42:5437-47 (2000)  
Target
Name:
Neutrophil elastase
Synonyms:
Bone marrow serine protease Coagulation factor X ELANE Elastase HLE Leukocyte elastase Medullasin Neutrophil elastase (HNE) PMN elastase Trypsin
Type:
Enzyme
Mol. Mass.:
28532.38
Organism:
Homo sapiens (Human)
Description:
P08246
Residue:
267
  
Inhibitor
Name:
BDBM50084228
Synonyms:
2-(diethylamino)-5-methyl-4H-thieno[2,3-d][1,3]oxazin-4-one CHEMBL153631
Type:
Small organic molecule
Emp. Form.:
C11H14N2O2S
Mol. Mass.:
238.306
SMILES:
CCN(CC)c1nc2scc(C)c2c(=O)o1
: