Target
Short transient receptor potential channel 5
Ligand
BDBM50529438
Substrate
Meas. Tech.
ChEMBL_1908620 (CHEMBL4410978)
IC50
27000±n/a nM
Citation
 Yu, MLedeboer, MWDaniels, MMalojcic, GTibbitts, TTCoeffet-Le Gal, MPan-Zhou, XRWesterling-Bui, ABeconi, MReilly, JFMundel, PHarmange, JC Discovery of a Potent and Selective TRPC5 Inhibitor, Efficacious in a Focal Segmental Glomerulosclerosis Model. ACS Med Chem Lett 10:1579-1585 (2019)  
Target
Name:
Short transient receptor potential channel 5
Synonyms:
TRP5 TRPC5_HUMAN | Transient receptor protein 5 (TRPC5)
Type:
Enzyme
Mol. Mass.:
111421.47
Organism:
Homo sapiens (Human)
Description:
Q9UL62
Residue:
973
  
Inhibitor
Name:
BDBM50529438
Synonyms:
CHEMBL4528028
Type:
Small organic molecule
Emp. Form.:
C17H21BrN4O
Mol. Mass.:
377.279
SMILES:
Cc1ccccc1CN1CCN(CC1)c1cnn(C)c(=O)c1Br
: