Target
Kappa-type opioid receptor
Ligand
BDBM50529506
Substrate
Meas. Tech.
ChEMBL_1908762 (CHEMBL4411120)
Ki
0.794328±n/a nM
Citation
 Long, DDArmstrong, SRBeattie, DTCampbell, CBChurch, TJColson, PJDalziel, SMJacobsen, JRJiang, LObedencio, GPRapta, MSaito, DStergiades, ITsuruda, PRVan Dyke, PMVickery, RG Discovery of Axelopran (TD-1211): A Peripherally Restricted ?-Opioid Receptor Antagonist. ACS Med Chem Lett 10:1641-1647 (2019)  
Target
Name:
Kappa-type opioid receptor
Synonyms:
Kappa Opioid Receptor OPRK1 Opiate Kappa 1 | mu/kappa opioid receptor
Type:
G Protein-Coupled Receptor (GPCR)
Mol. Mass.:
42744.99
Organism:
Cavia porcellus (domestic guinea pig)
Description:
P41144
Residue:
380
  
Inhibitor
Name:
BDBM50529506
Synonyms:
CHEMBL4475360
Type:
Small organic molecule
Emp. Form.:
C24H37N3O3S
Mol. Mass.:
447.634
SMILES:
[H][C@]12CC[C@]([H])(C[C@@H](C1)c1cccc(c1)C(N)=O)N2CCN(CC1CCCCC1)S(C)(=O)=O
: