Target
Mu-type opioid receptor
Ligand
BDBM60212
Substrate
Meas. Tech.
ChEMBL_1908760 (CHEMBL4411118)
Ki
0.158489±n/a nM
Citation
 Long, DDArmstrong, SRBeattie, DTCampbell, CBChurch, TJColson, PJDalziel, SMJacobsen, JRJiang, LObedencio, GPRapta, MSaito, DStergiades, ITsuruda, PRVan Dyke, PMVickery, RG Discovery of Axelopran (TD-1211): A Peripherally Restricted ?-Opioid Receptor Antagonist. ACS Med Chem Lett 10:1641-1647 (2019)  
Target
Name:
Mu-type opioid receptor
Synonyms:
M-OR-1 MOR-1 MUOR1 Mu opiate receptor OPRM1 hMOP | mu-type opioid receptor isoform MOR-1
Type:
G Protein-Coupled Receptor (GPCR)
Mol. Mass.:
44789.51
Organism:
Homo sapiens (Human)
Description:
P35372
Residue:
400
  
Inhibitor
Name:
BDBM60212
Synonyms:
(4R,4aS,7aR,12bS)-3-(cyclopropylmethyl)-4a,9-bis(oxidanyl)-2,4,5,6,7a,13-hexahydro-1H-4,12-methanobenzofuro[3,2-e]isoquinoline-7-one;hydrochloride MLS000069607 SMR000058767 US9107954, naltrexone | cid_5485201
Type:
Small organic molecule
Emp. Form.:
C20H23NO4
Mol. Mass.:
341.4009
SMILES:
Oc1ccc2C[C@H]3N(CC4CC4)CC[C@@]45[C@@H](Oc1c24)C(=O)CC[C@@]35O
: