Target
Tyrosine-protein kinase JAK1
Ligand
BDBM329924
Substrate
Meas. Tech.
ChEMBL_1909148 (CHEMBL4411594)
IC50
17±n/a nM
Citation
 Fensome, AAmbler, CMArnold, EBanker, MEBrown, MFChrencik, JClark, JDDowty, MEEfremov, IVFlick, AGerstenberger, BSGopalsamy, AHayward, MMHegen, MHollingshead, BDJussif, JKnafels, JDLimburg, DCLin, DLin, THPierce, BSSaiah, ESharma, RSymanowicz, PTTelliez, JBTrujillo, JIVajdos, FFVincent, FWan, ZKXing, LYang, XYang, XZhang, L Dual Inhibition of TYK2 and JAK1 for the Treatment of Autoimmune Diseases: Discovery of (( S)-2,2-Difluorocyclopropyl)((1 R,5 S)-3-(2-((1-methyl-1 H-pyrazol-4-yl)amino)pyrimidin-4-yl)-3,8-diazabicyclo[3.2.1]octan-8-yl)methanone (PF-06700841). J Med Chem 61:8597-8612 (2018)  
Target
Name:
Tyrosine-protein kinase JAK1
Synonyms:
JAK-1 JAK1A JAK1_HUMAN Janus kinase 1 (JAK1) | Janus kinase 1 JAK1
Type:
Protein
Mol. Mass.:
133293.73
Organism:
Homo sapiens (Human)
Description:
P23458
Residue:
1154
  
Inhibitor
Name:
BDBM329924
Synonyms:
US10463675, Example 7 US11197867, Example 7 | US9663526, Example 7
Type:
Small organic molecule
Emp. Form.:
C18H21F2N7O
Mol. Mass.:
389.4024
SMILES:
Cn1cc(Nc2nccc(n2)N2C[C@@H]3CC[C@H](C2)N3C(=O)[C@@H]2CC2(F)F)cn1
: