Target
Cysteinyl leukotriene receptor 1
Ligand
BDBM50084799
Substrate
Meas. Tech.
ChEMBL_52222 (CHEMBL663972)
Ki
44±n/a nM
Citation
 Palomer, APascual, JCabré, FGarcía, MLMauleón, D Derivation of pharmacophore and CoMFA models for leukotriene D(4) receptor antagonists of the quinolinyl(bridged)aryl series. J Med Chem 43:392-400 (2000)  
Target
Name:
Cysteinyl leukotriene receptor 1
Synonyms:
CLTR1_CAVPO | CYSLTR1
Type:
Enzyme Catalytic Domain
Mol. Mass.:
39007.58
Organism:
GUINEA PIG
Description:
Leukotriene D4 0 GUINEA PIG::Q2NNR5
Residue:
340
  
Inhibitor
Name:
BDBM50084799
Synonyms:
4-(4-(4-(quinolin-2-ylmethoxy)benzylcarbamoyl)phenyl)butanoic acid CHEMBL128151
Type:
Small organic molecule
Emp. Form.:
C28H26N2O4
Mol. Mass.:
454.517
SMILES:
OC(=O)CCCc1ccc(cc1)C(=O)NCc1ccc(OCc2ccc3ccccc3n2)cc1
: