Target
Egl nine homolog 1/Prolyl hydroxylase EGLN2/Prolyl hydroxylase EGLN3/Transmembrane prolyl 4-hydroxylase
Ligand
BDBM50529633
Substrate
Meas. Tech.
ChEMBL_1909275 (CHEMBL4411721)
EC50
7700±n/a nM
Citation
 Minassi, ARogati, FCruz, CPrados, MEGalera, NJinénez, CAppendino, GBellido, MLCalzado, MACaprioglio, DMuñoz, E Triterpenoid Hydroxamates as HIF Prolyl Hydrolase Inhibitors. J Nat Prod 81:2235-2243 (2018)  
Target
Name:
Egl nine homolog 1/Prolyl hydroxylase EGLN2/Prolyl hydroxylase EGLN3/Transmembrane prolyl 4-hydroxylase
Synonyms:
Hypoxia-inducible factor prolyl hydroxylase
Type:
Mol. Mass.:
Description:
ASSAY_ID of ChEMBL is 1909275
Components:
This complex has 4 components.
Component 1
Name:
Prolyl hydroxylase EGLN2
Synonyms:
EGLN2 EIT6 Estrogen-induced tag 6 HIF-PH1 HPH-3 PHD1 Prolyl hydroxylase domain-containing protein 1 (PHD1)
Type:
Protein
Mol. Mass.:
43657.01
Organism:
Homo sapiens (Human)
Description:
Q96KS0
Residue:
407
  
Component 2
Name:
Transmembrane prolyl 4-hydroxylase
Synonyms:
Hypoxia-inducible factor prolyl 4-hydroxylase Hypoxia-inducible factor prolyl hydroxylase 4 P4HTM PH4 | Transmembrane prolyl 4-hydroxylase
Type:
Enzyme
Mol. Mass.:
56654.25
Organism:
Homo sapiens (Human)
Description:
Q9NXG6
Residue:
502
  
Component 3
Name:
Egl nine homolog 1
Synonyms:
C1orf12 EGLN1_HUMAN Hypoxia-inducible factor prolyl hydroxylase 2 (HIF-PH2) Prolyl hydroxylase domain-containing protein 2 (PHD2)
Type:
Protein
Mol. Mass.:
46035.59
Organism:
Homo sapiens (Human)
Description:
Q9GZT9
Residue:
426
  
Component 4
Name:
Prolyl hydroxylase EGLN3
Synonyms:
EGLN3 Egl nine homolog 3 (EGLIN3) | Egl nine homolog 3 (EGLN3)
Type:
Protein
Mol. Mass.:
27265.54
Organism:
Homo sapiens (Human)
Description:
Q9H6Z9
Residue:
239
  
Inhibitor
Name:
BDBM50529633
Synonyms:
CHEMBL3753400
Type:
Small organic molecule
Emp. Form.:
C30H49NO3
Mol. Mass.:
471.715
SMILES:
[H][C@@]12CC[C@]3(C)[C@]([H])(CC=C4[C@]5([H])[C@@H](C)[C@H](C)CC[C@@]5(CC[C@@]34C)C(=O)NO)[C@@]1(C)CC[C@H](O)C2(C)C
: