Target
Discoidin domain-containing receptor 2
Ligand
BDBM50529763
Substrate
Meas. Tech.
ChEMBL_1909870 (CHEMBL4412316)
IC50
3.9±n/a nM
Citation
 Wang, QDai, YJi, YShi, HGuo, ZChen, DChen, YPeng, XGao, YWang, XChen, LJiang, YGeng, MShen, JAi, JXiong, B Discovery and optimization of a series of 3-substituted indazole derivatives as multi-target kinase inhibitors for the treatment of lung squamous cell carcinoma. Eur J Med Chem 163:671-689 (2019)  
Target
Name:
Discoidin domain-containing receptor 2
Synonyms:
DDR2 Discoidin domain receptor 2 (DDR2) Discoidin domain-containing receptor 2 (DDR2) NTRKR3 TYRO10
Type:
Protein
Mol. Mass.:
96717.07
Organism:
Homo sapiens (Human)
Description:
Q16832
Residue:
855
  
Inhibitor
Name:
BDBM50529763
Synonyms:
CHEMBL4521671
Type:
Small organic molecule
Emp. Form.:
C29H30F3N5O
Mol. Mass.:
521.5766
SMILES:
CCN1CCN(Cc2cc(NC(=O)c3ccc(C)c(c3)-c3ccc4cn[nH]c4c3)cc(c2)C(F)(F)F)CC1
: