Target
Discoidin domain-containing receptor 2
Ligand
BDBM50529779
Substrate
Meas. Tech.
ChEMBL_1909870 (CHEMBL4412316)
IC50
2.7±n/a nM
Citation
 Wang, QDai, YJi, YShi, HGuo, ZChen, DChen, YPeng, XGao, YWang, XChen, LJiang, YGeng, MShen, JAi, JXiong, B Discovery and optimization of a series of 3-substituted indazole derivatives as multi-target kinase inhibitors for the treatment of lung squamous cell carcinoma. Eur J Med Chem 163:671-689 (2019)  
Target
Name:
Discoidin domain-containing receptor 2
Synonyms:
DDR2 Discoidin domain receptor 2 (DDR2) Discoidin domain-containing receptor 2 (DDR2) NTRKR3 TYRO10
Type:
Protein
Mol. Mass.:
96717.07
Organism:
Homo sapiens (Human)
Description:
Q16832
Residue:
855
  
Inhibitor
Name:
BDBM50529779
Synonyms:
CHEMBL4525313
Type:
Small organic molecule
Emp. Form.:
C25H22N4O
Mol. Mass.:
394.4684
SMILES:
Cc1ccc(cc1-c1ccc2cn[nH]c2c1)C(=O)Nc1cccc(c1)C(C)(C)C#N
: