Target
Non-receptor tyrosine-protein kinase TYK2 [5-1181]
Ligand
BDBM50530398
Substrate
Meas. Tech.
ChEMBL_1912217 (CHEMBL4414800)
IC50
450±n/a nM
Target
Name:
Non-receptor tyrosine-protein kinase TYK2 [5-1181]
Synonyms:
Non-receptor tyrosine-protein kinase TYK2 Tyk2
Type:
PROTEIN
Mol. Mass.:
132654.63
Organism:
Mus musculus
Description:
ChEMBL_105608
Residue:
1177
  
Inhibitor
Name:
BDBM50530398
Synonyms:
CHEMBL4526283
Type:
Small organic molecule
Emp. Form.:
C19H18FN5O3S
Mol. Mass.:
415.441
SMILES:
CNC(=O)c1cnc(Nc2ccc(F)cn2)cc1Nc1ccccc1S(C)(=O)=O
: