Target
Epidermal growth factor receptor
Ligand
BDBM250082
Substrate
Meas. Tech.
ChEMBL_1912354 (CHEMBL4414937)
IC50
606±n/a nM
Citation
 Guo, YLiu, YHu, NYu, DZhou, CShi, GZhang, BWei, MLiu, JLuo, LTang, ZSong, HGuo, YLiu, XSu, DZhang, SSong, XZhou, XHong, YChen, SCheng, ZYoung, SWei, QWang, HWang, QLv, LWang, FXu, HSun, HXing, HLi, NZhang, WWang, ZLiu, GSun, ZZhou, DLi, WLiu, LWang, LWang, Z Discovery of Zanubrutinib (BGB-3111), a Novel, Potent, and Selective Covalent Inhibitor of Bruton's Tyrosine Kinase. J Med Chem 62:7923-7940 (2019)  
Target
Name:
Epidermal growth factor receptor
Synonyms:
EGF Receptor Substrate EGFR_HUMAN ERBB1 Epidermal Growth Factor Receptor erbB-1 Epidermal growth factor receptor (EGFR) HER1 Proto-oncogene c-ErbB-1 Tyrosine-Protein Kinase ErbB-1
Type:
Receptor Kinase Domain
Mol. Mass.:
134279.59
Organism:
Homo sapiens (Human)
Description:
P00533
Residue:
1210
  
Inhibitor
Name:
BDBM250082
Synonyms:
US9447106, 27b (peak 2) | US9556188, Compound 27a
Type:
Small organic molecule
Emp. Form.:
C27H29N5O3
Mol. Mass.:
471.5509
SMILES:
NC(=O)c1c2NCC[C@@H](C3CCN(CC3)C(=O)C=C)n2nc1-c1ccc(Oc2ccccc2)cc1
: