Target
Smoothened homolog
Ligand
BDBM50530453
Substrate
Meas. Tech.
ChEMBL_1912594 (CHEMBL4415177)
Ki
33±n/a nM
Citation
 Zhou, FDing, KZhou, YLiu, YLiu, XZhao, FWu, YZhang, XTan, QXu, FTan, WXiao, YZhao, STao, H Colocalization Strategy Unveils an Underside Binding Site in the Transmembrane Domain of Smoothened Receptor. J Med Chem 62:9983-9989 (2019)  
Target
Name:
Smoothened homolog
Synonyms:
G-protein- coupled-like receptor Smoothened (Smo) SMOH Smoothened homolog
Type:
Protein
Mol. Mass.:
86415.51
Organism:
Homo sapiens (Human)
Description:
Q99835
Residue:
787
  
Inhibitor
Name:
BDBM50530453
Synonyms:
CHEMBL4586057
Type:
Small organic molecule
Emp. Form.:
C17H15ClN2O2
Mol. Mass.:
314.766
SMILES:
C[C@@H]1N(Cc2ccccc2)C(=O)N(C1=O)c1ccc(Cl)cc1
: