Target
Gonadotropin-releasing hormone receptor
Ligand
BDBM50085746
Substrate
Meas. Tech.
ChEMBL_71751 (CHEMBL680273)
Ki
0.34±n/a nM
Citation
 Rivier, JEPorter, JCervini, LALahrichi, SLKirby, DAStruthers, RSKoerber, SCRivier, CL Design of monocyclic (1-3) and dicyclic (1-3/4-10) gonadotropin releasing hormone (GnRH) antagonists. J Med Chem 43:797-806 (2000)  
Target
Name:
Gonadotropin-releasing hormone receptor
Synonyms:
GNRHR_RAT GnRH-R | Gnrhr
Type:
PROTEIN
Mol. Mass.:
37767.60
Organism:
Rattus norvegicus
Description:
ChEMBL_1335047
Residue:
327
  
Inhibitor
Name:
BDBM50085746
Synonyms:
CHEMBL405223 | cyclo(1,1'-3)Ac-D-Asp (Gly)-D-Cpa-D-Orn-Ser-Tyr-D-Nal-Leu-Arg-Pro-D-Ala-NH2
Type:
Small organic molecule
Emp. Form.:
C67H89ClN16O15
Mol. Mass.:
1393.975
SMILES:
CC(C)C[C@@H](NC(=O)C(Cc1ccc2ccccc2c1)NC(=O)[C@H](Cc1ccc(O)cc1)NC(=O)[C@H](CO)NC(=O)[C@H]1CCCNC(=O)[C@@H](Cc2ccc(Cl)cc2)NC(=O)C(CC(=O)NCC(=O)N1)NC(C)=O)C(=O)N[C@@H](CCCNC(N)=N)C(=O)N1CCC[C@@H]1C(=O)NC(C)C(N)=O
: