Target
Prostaglandin E2 receptor EP4 subtype
Ligand
BDBM50035622
Substrate
Meas. Tech.
ChEMBL_158329 (CHEMBL767812)
IC50
4200±n/a nM
Citation
 Wang, YWos, JADirr, MJSoper, DLdeLong, MAMieling, GEDe, BAmburgey, JSSuchanek, EGTaylor, CJ Design and synthesis of 13,14-dihydro prostaglandin F(1alpha) analogues as potent and selective ligands for the human FP receptor. J Med Chem 43:945-52 (2000)  
Target
Name:
Prostaglandin E2 receptor EP4 subtype
Synonyms:
PE2R4_HUMAN PGE2 receptor EP4 subtype PTGER4 Prostanoid EP4 receptor
Type:
Enzyme
Mol. Mass.:
53134.53
Organism:
Homo sapiens (Human)
Description:
P35408
Residue:
488
  
Inhibitor
Name:
BDBM50035622
Synonyms:
(5Z,13E,15S)-9alpha,11alpha,15-trihydroxyprosta-5,13-dien-1-oic acid DINOPROST l-PGF2-alpha prostaglandin F2alpha
Type:
Small organic molecule
Emp. Form.:
C20H34O5
Mol. Mass.:
354.481
SMILES:
CCCCC[C@H](O)\C=C\[C@H]1[C@H](O)C[C@H](O)[C@@H]1C\C=C/CCCC(O)=O
: