Target
D(2) dopamine receptor
Ligand
BDBM50530681
Substrate
Meas. Tech.
ChEMBL_1913690 (CHEMBL4416273)
Kd
1.0±n/a nM
Citation
 Fyfe, TJKellam, BSykes, DACapuano, BScammells, PJLane, JRCharlton, SJMistry, SN Structure-Kinetic Profiling of Haloperidol Analogues at the Human Dopamine D J Med Chem 62:9488-9520 (2019)  
Target
Name:
D(2) dopamine receptor
Synonyms:
D(2) dopamine receptor DOPAMINE D2 Long DRD2 Dopamine D2 receptor Dopamine D2 receptor (D2R) Dopamine2-like | d2
Type:
Cell-surface receptors
Mol. Mass.:
50647.10
Organism:
Homo sapiens (Human)
Description:
P14416
Residue:
443
  
Inhibitor
Name:
BDBM50530681
Synonyms:
CHEMBL4529368
Type:
Small organic molecule
Emp. Form.:
C21H22Cl2FNO2
Mol. Mass.:
410.309
SMILES:
OC1(CCN(CCCC(=O)c2ccc(F)cc2)CC1)c1cc(Cl)ccc1Cl
: