Target
D(2) dopamine receptor
Ligand
BDBM50530693
Substrate
Meas. Tech.
ChEMBL_1913690 (CHEMBL4416273)
Kd
1.9±n/a nM
Citation
 Fyfe, TJKellam, BSykes, DACapuano, BScammells, PJLane, JRCharlton, SJMistry, SN Structure-Kinetic Profiling of Haloperidol Analogues at the Human Dopamine D J Med Chem 62:9488-9520 (2019)  
Target
Name:
D(2) dopamine receptor
Synonyms:
D(2) dopamine receptor DOPAMINE D2 Long DRD2 Dopamine D2 receptor Dopamine D2 receptor (D2R) Dopamine2-like | d2
Type:
Cell-surface receptors
Mol. Mass.:
50647.10
Organism:
Homo sapiens (Human)
Description:
P14416
Residue:
443
  
Inhibitor
Name:
BDBM50530693
Synonyms:
CHEMBL422334
Type:
Small organic molecule
Emp. Form.:
C22H25ClFNO2
Mol. Mass.:
389.891
SMILES:
COC1(CCN(CCCC(=O)c2ccc(F)cc2)CC1)c1ccc(Cl)cc1
: