Target
Growth factor receptor-bound protein 2
Ligand
BDBM50087245
Substrate
Meas. Tech.
ChEBML_72500
Kd
260±n/a nM
Citation
 Liu, WQVidal, MMathé, CPérigaud, CGarbay, C Inhibition of the ras-dependent mitogenic pathway by phosphopeptide prodrugs with antiproliferative properties. Bioorg Med Chem Lett 10:669-72 (2000)  
Target
Name:
Growth factor receptor-bound protein 2
Synonyms:
ASH GRB2 adapter protein Grb2-SH2 | Growth factor receptor-bound protein 2
Type:
Protein
Mol. Mass.:
25205.04
Organism:
Homo sapiens (Human)
Description:
P62993
Residue:
217
  
Inhibitor
Name:
BDBM50087245
Synonyms:
CHEMBL345170 | Pro-Ser-Pmp-Val-Asn-Val-Gln-Asn
Type:
Small organic molecule
Emp. Form.:
C41H64N11O16P
Mol. Mass.:
997.9847
SMILES:
CC(C)[C@H](NC(=O)[C@H](CC(N)=O)NC(=O)[C@@H](NC(=O)[C@H](Cc1ccc(CP(O)(O)=O)cc1)NC(=O)[C@H](CO)NC(=O)[C@@H]1CCCN1)C(C)C)C(=O)N[C@@H](CCC(N)=O)C(=O)N[C@@H](CC(N)=O)C(O)=O
: