Target
Cannabinoid receptor 1
Ligand
BDBM50061117
Substrate
Meas. Tech.
ChEMBL_1922124 (CHEMBL4424969)
Ki
13±n/a nM
Citation
 Cunningham, CW Plant-Based Modulators of Endocannabinoid Signaling. J Nat Prod 82:636-646 (2019)  
Target
Name:
Cannabinoid receptor 1
Synonyms:
CANN6 CB-R CNR CNR1_HUMAN Cannabinoid receptor Cannabinoid receptor 1 (brain)
Type:
G Protein-Coupled Receptor (GPCR)
Mol. Mass.:
52868.96
Organism:
Homo sapiens (Human)
Description:
P21554
Residue:
472
  
Inhibitor
Name:
BDBM50061117
Synonyms:
6,6,9-Trimethyl-3-pentyl-6H-benzo[c]chromen-1-ol 6,6,9-Trimethyl-3-pentyl-6H-benzo[c]chromen-1-ol(Cannabinol) CBN | CHEMBL74415
Type:
Small organic molecule
Emp. Form.:
C21H26O2
Mol. Mass.:
310.4299
SMILES:
CCCCCc1cc(O)c-2c(OC(C)(C)c3ccc(C)cc-23)c1
: