Target
Cone cGMP-specific 3',5'-cyclic phosphodiesterase subunit alpha'/cGMP-specific 3',5'-cyclic phosphodiesterase
Ligand
BDBM14390
Substrate
Meas. Tech.
ChEMBL_1922374 (CHEMBL4425330)
Ki
25±n/a nM
Citation
 Jansen, CKooistra, AJKanev, GKLeurs, Rde Esch, IJde Graaf, C PDEStrIAn: A Phosphodiesterase Structure and Ligand Interaction Annotated Database As a Tool for Structure-Based Drug Design. J Med Chem 59:7029-65 (2016)  
Target
Name:
Cone cGMP-specific 3',5'-cyclic phosphodiesterase subunit alpha'/cGMP-specific 3',5'-cyclic phosphodiesterase
Synonyms:
PDE5A/PDE6C
Type:
Mol. Mass.:
Description:
ASSAY_ID of ChEMBL is 1922374
Components:
This complex has 2 components.
Component 1
Name:
cGMP-specific 3',5'-cyclic phosphodiesterase
Synonyms:
3',5'-cyclic phosphodiesterase PDE5 PDE5A_HUMAN Phosphodiesterase 5 (PDE5) Phosphodiesterase 5A (PDE5A) cGMP-specific 3',5'-cyclic phosphodiesterase
Type:
Protein
Mol. Mass.:
99975.83
Organism:
Homo sapiens (Human)
Description:
O76074
Residue:
875
  
Component 2
Name:
Cone cGMP-specific 3',5'-cyclic phosphodiesterase subunit alpha'
Synonyms:
3',5'-cyclic phosphodiesterase PDE6C_HUMAN Phosphodiesterase 6C | Phosphodiesterase 6C (PDE6C)
Type:
Protein
Mol. Mass.:
99132.02
Organism:
Homo sapiens (Human)
Description:
P51160
Residue:
858
  
Inhibitor
Name:
BDBM14390
Synonyms:
5-[2-ethoxy-5-(4-methyl-1-piperazinylsulfonyl)phenyl]-1-methyl-3-n-propyl-1,6-dihydro-7H-pyrazolo[4,3-d]pyrimidin-7-one CHEMBL192 Sildenafil US11155558, Compound sildenafil Viagra
Type:
Small organic molecule
Emp. Form.:
C22H30N6O4S
Mol. Mass.:
474.576
SMILES:
CCCc1nn(C)c2c1nc([nH]c2=O)-c1cc(ccc1OCC)S(=O)(=O)N1CCN(C)CC1
: