Target
Mitogen-activated protein kinase 1
Ligand
BDBM50532352
Substrate
Meas. Tech.
ChEMBL_1922956 (CHEMBL4425912)
IC50
16±n/a nM
Citation
 Blake, JFBurkard, MChan, JChen, HChou, KJDiaz, DDudley, DAGaudino, JJGould, SEGrina, JHunsaker, TLiu, LMartinson, MMoreno, DMueller, LOrr, CPacheco, PQin, ARasor, KRen, LRobarge, KShahidi-Latham, SStults, JSullivan, FWang, WYin, JZhou, ABelvin, MMerchant, MMoffat, JSchwarz, JB Discovery of (S)-1-(1-(4-Chloro-3-fluorophenyl)-2-hydroxyethyl)-4-(2-((1-methyl-1H-pyrazol-5-yl)amino)pyrimidin-4-yl)pyridin-2(1H)-one (GDC-0994), an Extracellular Signal-Regulated Kinase 1/2 (ERK1/2) Inhibitor in Early Clinical Development. J Med Chem 59:5650-60 (2016)  
Target
Name:
Mitogen-activated protein kinase 1
Synonyms:
ERK2 Extracellular signal-regulated kinase 2 Extracellular signal-regulated kinase 2 (ERK2) MAPK 2 MK01_HUMAN Mitogen-activated protein kinase 1 (ERK-2) Mitogen-activated protein kinase 2 PRKM2 | p42-MAPK
Type:
Ser/Thr Protein Kinase
Mol. Mass.:
41392.76
Organism:
Homo sapiens (Human)
Description:
P28482
Residue:
360
  
Inhibitor
Name:
BDBM50532352
Synonyms:
CHEMBL4452981
Type:
Small organic molecule
Emp. Form.:
C22H20ClFN6O2
Mol. Mass.:
454.885
SMILES:
CCn1nccc1Nc1nccc(n1)-c1ccn([C@H](CO)c2ccc(Cl)c(F)c2)c(=O)c1
: