Target
Carbonic anhydrase 9
Ligand
BDBM29278
Substrate
Meas. Tech.
ChEMBL_1923159 (CHEMBL4426115)
Ki
103±n/a nM
Citation
 Coviello, VMarchi, BSartini, SQuattrini, LMarini, AMSimorini, FTaliani, SSalerno, SOrlandi, PFioravanti, ADesidero, TDVullo, DDa Settimo, FSupuran, CTBocci, GLa Motta, C 1,2-Benzisothiazole Derivatives Bearing 4-, 5-, or 6-Alkyl/arylcarboxamide Moieties Inhibit Carbonic Anhydrase Isoform IX (CAIX) and Cell Proliferation under Hypoxic Conditions. J Med Chem 59:6547-52 (2016)  
Target
Name:
Carbonic anhydrase 9
Synonyms:
CA-IX CAH9_HUMAN Carbonic anhydrase 9 (CA IX) Carbonic anhydrase 9 precursor Carbonic anhydrase IX (CAIX) Carbonic anhydrases; II & IX MN RCC-associated antigen G250
Type:
Enzyme
Mol. Mass.:
49669.03
Organism:
Homo sapiens (Human)
Description:
Catalytic domain of human cloned isozyme was used in the assay
Residue:
459
  
Inhibitor
Name:
BDBM29278
Synonyms:
CHEMBL310671 SAC Saccharin
Type:
Small organic molecule
Emp. Form.:
C7H5NO3S
Mol. Mass.:
183.185
SMILES:
O=C1NS(=O)(=O)c2ccccc12
: