Target
Amine oxidase [flavin-containing] A
Ligand
BDBM50172756
Substrate
Meas. Tech.
ChEMBL_1923700 (CHEMBL4426656)
IC50
10900±n/a nM
Citation
 Pisani, LFarina, RCatto, MIacobazzi, RMNicolotti, OCellamare, SMangiatordi, GFDenora, NSoto-Otero, RSiragusa, LAltomare, CDCarotti, A Exploring Basic Tail Modifications of Coumarin-Based Dual Acetylcholinesterase-Monoamine Oxidase B Inhibitors: Identification of Water-Soluble, Brain-Permeant Neuroprotective Multitarget Agents. J Med Chem 59:6791-806 (2016)  
Target
Name:
Amine oxidase [flavin-containing] A
Synonyms:
AOFA_HUMAN MAO-A Monoamine oxidase Monoamine oxidase type A (MAO A) Monoamine oxidase type A (MAOA)
Type:
Protein
Mol. Mass.:
59689.53
Organism:
Homo sapiens (Human)
Description:
P21397
Residue:
527
  
Inhibitor
Name:
BDBM50172756
Synonyms:
Benzyl-methyl-prop-2-ynyl-amine Eutonyl N-benzyl-N-methylprop-2-yn-1-amine US9603833, Pargyline
Type:
Small organic molecule
Emp. Form.:
C11H13N
Mol. Mass.:
159.2276
SMILES:
CN(CC#C)Cc1ccccc1
: