Target
Cannabinoid receptor 1
Ligand
BDBM50532778
Substrate
Meas. Tech.
ChEMBL_1923901 (CHEMBL4426857)
Ki
0.100000±n/a nM
Citation
 Kulkarni, SNikas, SPSharma, RJiang, SParonis, CALeonard, MZZhang, BHonrao, CMallipeddi, SRaghav, JGBenchama, OJärbe, TUBergman, JMakriyannis, A Novel C-Ring-Hydroxy-Substituted Controlled Deactivation Cannabinergic Analogues. J Med Chem 59:6903-19 (2016)  
Target
Name:
Cannabinoid receptor 1
Synonyms:
Brain-type cannabinoid receptor CB-R CNR1_RAT Cannabinoid receptor Cnr1 | Skr6
Type:
G Protein-Coupled Receptor (GPCR)
Mol. Mass.:
52856.55
Organism:
Rattus norvegicus (rat)
Description:
P20272
Residue:
473
  
Inhibitor
Name:
BDBM50532778
Synonyms:
CHEMBL4465566 | US10882838, Example 3.6
Type:
Small organic molecule
Emp. Form.:
C23H34O5
Mol. Mass.:
390.5131
SMILES:
[H][C@@]12C[C@H](O)CC[C@@]1([H])C(C)(C)Oc1cc(cc(O)c21)C(C)(C)C(=O)OCCCC
: