Target
5-hydroxytryptamine receptor 2C
Ligand
BDBM50532827
Substrate
Meas. Tech.
ChEMBL_1923998 (CHEMBL4426954)
Ki
120±n/a nM
Citation
 Green, MPMcMurray, GStorer, RI Selective 5-HT2C receptor agonists: Design and synthesis of pyridazine-fused azepines. Bioorg Med Chem Lett 26:4117-21 (2016)  
Target
Name:
5-hydroxytryptamine receptor 2C
Synonyms:
5-HT-2C 5-HT2C-INI 5-HTR2C 5-hydroxytryptamine receptor 2C (5-HT-2C) 5HT-1C HTR1C Serotonin (5-HT3) receptor Serotonin Receptor 2C
Type:
G Protein-Coupled Receptor (GPCR)
Mol. Mass.:
51836.79
Organism:
Homo sapiens (Human)
Description:
P28335
Residue:
458
  
Inhibitor
Name:
BDBM50532827
Synonyms:
CHEMBL4571641
Type:
Small organic molecule
Emp. Form.:
C15H16ClN3
Mol. Mass.:
273.761
SMILES:
Clc1ccc(Cc2cc3CCNCCc3nn2)cc1
: