Target
P2X purinoceptor 2/3
Ligand
BDBM86478
Substrate
Meas. Tech.
ChEMBL_1924238 (CHEMBL4427194)
Ki
9.0±n/a nM
Citation
 Szántó, GMakó, ABata, IFarkas, BKolok, SVastag, MCselenyák, A New P2X3 receptor antagonists. Part 1: Discovery and optimization of tricyclic compounds. Bioorg Med Chem Lett 26:3896-904 (2016)  
Target
Name:
P2X purinoceptor 2/3
Synonyms:
P2X2/3 | P2X2/P2X3 heterotrimeric receptor
Type:
Protein
Mol. Mass.:
Description:
Components:
This complex has 2 components.
Component 1
Name:
P2X purinoceptor 2
Synonyms:
ATP receptor P2RX2_HUMAN Purinergic receptor | PurinergicP2X2/3
Type:
Enzyme Catalytic Domain
Mol. Mass.:
51765.18
Organism:
Homo sapiens (Human)
Description:
PurinergicP2X2/3 0 HUMAN::Q9UBL9
Residue:
471
  
Component 2
Name:
P2X purinoceptor 3
Synonyms:
ATP receptor P2RX3 P2X purinoceptor 3 P2X purinoceptor 3 (P2X3) P2X3 purinoceptor p2x3 + hsa
Type:
Protein
Mol. Mass.:
44292.02
Organism:
Homo sapiens (Human)
Description:
P56373
Residue:
397
  
Inhibitor
Name:
BDBM86478
Synonyms:
A-317491
Type:
Small organic molecule
Emp. Form.:
C33H27NO8
Mol. Mass.:
565.5694
SMILES:
OC(=O)c1cc(C(O)=O)c(cc1C(O)=O)C(=O)N(Cc1cccc(Oc2ccccc2)c1)[C@H]1CCCc2ccccc12
: