Target
5-hydroxytryptamine receptor 1A
Ligand
BDBM50088844
Substrate
Meas. Tech.
ChEBML_1462
Ki
3.8±n/a nM
Citation
 Hanano, TAdachi, KAoki, YMorimoto, HNaka, YHisadome, MFukuda, TSumichika, H Novel phenylpiperazine derivatives as dual cytokine regulators with TNF-alpha suppressing and IL-10 augmenting activity. Bioorg Med Chem Lett 10:875-9 (2000)  
Target
Name:
5-hydroxytryptamine receptor 1A
Synonyms:
5-HT-1A 5-HT1A 5-hydroxytryptamine receptor 1A (5HT1A) 5ht1a Htr1a Serotonin 1a (5-HT1a) receptor/Adrenergic receptor alpha-1 | Serotonin receptor 1A
Type:
G Protein-Coupled Receptor (GPCR)
Mol. Mass.:
46445.29
Organism:
Rattus norvegicus (rat)
Description:
Binding assays were performed using rat hippocampal membranes.
Residue:
422
  
Inhibitor
Name:
BDBM50088844
Synonyms:
4-{4-[4-(4-Phenyl-piperazin-1-yl)-butyl]-phenyl}-thiazol-2-ylamine | CHEMBL171316
Type:
Small organic molecule
Emp. Form.:
C23H28N4S
Mol. Mass.:
392.56
SMILES:
Nc1nc(cs1)-c1ccc(CCCCN2CCN(CC2)c2ccccc2)cc1
: