Target
Neuropeptide Y receptor type 1
Ligand
BDBM50089035
Substrate
Meas. Tech.
ChEBML_143672
IC50
60000±n/a nM
Citation
 Rueeger, HRigollier, PYamaguchi, YSchmidlin, TSchilling, WCriscione, LWhitebread, SChiesi, MWalker, MWDhanoa, DIslam, IZhang, JGluchowski, C Design, synthesis and SAR of a series of 2-substituted 4-amino-quinazoline neuropeptide Y Y5 receptor antagonists. Bioorg Med Chem Lett 10:1175-9 (2000)  
Target
Name:
Neuropeptide Y receptor type 1
Synonyms:
NPY-Y1 NPY1R NPYR neuropeptide Y receptor Y1
Type:
Enzyme Catalytic Domain
Mol. Mass.:
44399.07
Organism:
Homo sapiens (Human)
Description:
NPY-Y1 NPY1R HUMAN::P25929
Residue:
384
  
Inhibitor
Name:
BDBM50089035
Synonyms:
2-[1-(4-Amino-6,7-dimethoxy-quinazolin-2-yl)-piperidin-4-yl]-2,3-dihydro-isoindol-1-one | CHEMBL18016
Type:
Small organic molecule
Emp. Form.:
C23H25N5O3
Mol. Mass.:
419.4763
SMILES:
COc1cc2nc(nc(N)c2cc1OC)N1CCC(CC1)N1Cc2ccccc2C1=O
: