Target
Neuropeptide Y receptor type 1
Ligand
BDBM50089046
Substrate
Meas. Tech.
ChEBML_143672
IC50
>10000±n/a nM
Citation
 Rueeger, HRigollier, PYamaguchi, YSchmidlin, TSchilling, WCriscione, LWhitebread, SChiesi, MWalker, MWDhanoa, DIslam, IZhang, JGluchowski, C Design, synthesis and SAR of a series of 2-substituted 4-amino-quinazoline neuropeptide Y Y5 receptor antagonists. Bioorg Med Chem Lett 10:1175-9 (2000)  
Target
Name:
Neuropeptide Y receptor type 1
Synonyms:
NPY-Y1 NPY1R NPYR neuropeptide Y receptor Y1
Type:
Enzyme Catalytic Domain
Mol. Mass.:
44399.07
Organism:
Homo sapiens (Human)
Description:
NPY-Y1 NPY1R HUMAN::P25929
Residue:
384
  
Inhibitor
Name:
BDBM50089046
Synonyms:
CHEMBL17022 | Naphthalene-2-sulfonic acid (4-{[(naphthalen-2-ylmethyl)-amino]-methyl}-cyclohexylmethyl)-amide
Type:
Small organic molecule
Emp. Form.:
C29H32N2O2S
Mol. Mass.:
472.642
SMILES:
O=S(=O)(NC[C@H]1CC[C@H](CNCc2ccc3ccccc3c2)CC1)c1ccc2ccccc2c1
: