Target
Neuropeptide Y receptor type 1
Ligand
BDBM50089062
Substrate
Meas. Tech.
ChEBML_143672
IC50
8900±n/a nM
Citation
 Rueeger, HRigollier, PYamaguchi, YSchmidlin, TSchilling, WCriscione, LWhitebread, SChiesi, MWalker, MWDhanoa, DIslam, IZhang, JGluchowski, C Design, synthesis and SAR of a series of 2-substituted 4-amino-quinazoline neuropeptide Y Y5 receptor antagonists. Bioorg Med Chem Lett 10:1175-9 (2000)  
Target
Name:
Neuropeptide Y receptor type 1
Synonyms:
NPY-Y1 NPY1R NPYR neuropeptide Y receptor Y1
Type:
Enzyme Catalytic Domain
Mol. Mass.:
44399.07
Organism:
Homo sapiens (Human)
Description:
NPY-Y1 NPY1R HUMAN::P25929
Residue:
384
  
Inhibitor
Name:
BDBM50089062
Synonyms:
1'-(4-Amino-6,7-dimethoxy-quinazolin-2-yl)-4-cyclohexyl-[1,4']bipiperidinyl-2,6-dione | CHEMBL17456
Type:
Small organic molecule
Emp. Form.:
C26H35N5O4
Mol. Mass.:
481.5872
SMILES:
COc1cc2nc(nc(N)c2cc1OC)N1CCC(CC1)N1C(=O)CC(CC1=O)C1CCCCC1
: